pepper-v
type: LexicalEntry
canonical form: pepper
sense: 01123738-v
part of speech: verb

pelt-v
type: LexicalEntry
canonical form: pelt
sense: 01123738-v
part of speech: verb

01123738-v
type: LexicalConcept
in scheme: en-word.net
definition: attack and bombard with or as if with missiles
example: pelt the speaker with questions
ili: i27203
lexfile: verb.competition
part of speech: verb
entails: 01511000-v
hypernym: 01121587-v