surrender-v
type: LexicalEntry
canonical form: surrender
sense: 01118003-v
part of speech: verb

give up-v
type: LexicalEntry
canonical form: give up
sense: 01118003-v
part of speech: verb

01118003-v
type: LexicalConcept
in scheme: en-word.net
definition: give up or agree to forgo to the power or possession of another
example: The last Taleban fighters finally surrendered
ili: i27176
lexfile: verb.competition
part of speech: verb
hypernym: 01118865-v