sign up-v
type: LexicalEntry
canonical form: sign up
sense: 01099720-v
part of speech: verb

01099720-v
type: LexicalConcept
in scheme: en-word.net
definition: join a club, an activity, etc. with the intention to join or participate
example: Sign up for yoga classes
ili: i27079
lexfile: verb.competition
part of speech: verb
hypernym: 02439823-v