contribution-n
type: LexicalEntry
canonical form: contribution
sense: 01091702-n
part of speech: noun

donation-n
type: LexicalEntry
canonical form: donation
sense: 01091702-n
part of speech: noun

01091702-n
type: LexicalConcept
in scheme: en-word.net
definition: act of giving in common with others for a common purpose especially to a charity
ili: i41118
lexfile: noun.act
part of speech: noun
hypernym: 01088005-n