endowment-n
type: LexicalEntry
canonical form: endowment
sense: 01088668-n
part of speech: noun

01088668-n
type: LexicalConcept
in scheme: en-word.net
definition: the act of endowing with a permanent source of income
example: his generous endowment of the laboratory came just in the nick of time
ili: i41100
lexfile: noun.act
part of speech: noun
hypernym: 01088005-n