convert-v
type: LexicalEntry
canonical form: convert
sense: 01087277-v
part of speech: verb

01087277-v
type: LexicalConcept
in scheme: en-word.net
definition: score an extra point or points after touchdown by kicking the ball through the uprights or advancing the ball into the end zone
example: Smith converted and his team won
ili: i27017
lexfile: verb.competition
part of speech: verb
hypernym: 01114241-v