confederation-n
type: LexicalEntry
canonical form: confederation
sense: 01083380-n
part of speech: noun

alliance-n
type: LexicalEntry
canonical form: alliance
sense: 01083380-n
part of speech: noun

01083380-n
type: LexicalConcept
in scheme: en-word.net
definition: the act of forming an alliance or confederation
ili: i41073
lexfile: noun.act
part of speech: noun
hypernym: 01082290-n