promote-v
type: LexicalEntry
canonical form: promote
sense: 01082628-v
part of speech: verb

01082628-v
type: LexicalConcept
in scheme: en-word.net
definition: change a pawn for a better piece by advancing it to the eighth row, or change a checker piece for a more valuable piece by moving it to the row closest to your opponent
ili: i26991
lexfile: verb.competition
part of speech: verb
domain topic: 00504248-n
hypernym: 01082457-v
similar: 01082916-v