unblock-v
type: LexicalEntry
canonical form: unblock
sense: 01078005-v
part of speech: verb

01078005-v
type: LexicalConcept
in scheme: en-word.net
definition: play the cards of (a suit) so that the last trick on which a hand can follow suit will be taken by a higher card in the hand of a partner who has the remaining cards of a combined holding
ili: i26966
lexfile: verb.competition
part of speech: verb
domain topic: 00489236-n
hypernym: 01075360-v