revoke-v
type: LexicalEntry
canonical form: revoke
sense: 01076750-v
part of speech: verb

01076750-v
type: LexicalConcept
in scheme: en-word.net
definition: fail to follow suit when able and required to do so
ili: i26958
lexfile: verb.competition
part of speech: verb
domain topic: 00489236-n
hypernym: 01075360-v