introduce-v
type: LexicalEntry
canonical form: introduce
sense: 01067137-v
part of speech: verb

bring out-v
type: LexicalEntry
canonical form: bring out
sense: 01067137-v
part of speech: verb

01067137-v
type: LexicalConcept
in scheme: en-word.net
definition: bring before the public for the first time, as of an actor, song, etc.
ili: i26913
lexfile: verb.communication
part of speech: verb
hypernym: 00902866-v