issue-v
type: LexicalEntry
canonical form: issue
sense: 01065071-v
part of speech: verb

01065071-v
type: LexicalConcept
in scheme: en-word.net
definition: bring out an official document (such as a warrant)
ili: i26901
lexfile: verb.communication
part of speech: verb
hypernym: 00742582-v