caw-v
type: LexicalEntry
canonical form: caw
sense: 01061937-v
part of speech: verb

01061937-v
type: LexicalConcept
in scheme: en-word.net
definition: utter a cry, characteristic of crows, rooks, or ravens
ili: i26883
lexfile: verb.communication
part of speech: verb
hypernym: 00985856-v