gobble-v
type: LexicalEntry
canonical form: gobble
sense: 01060298-v
part of speech: verb

01060298-v
type: LexicalConcept
in scheme: en-word.net
definition: make a gurgling sound, characteristic of turkeys
ili: i26875
lexfile: verb.communication
part of speech: verb
hypernym: 00985856-v