squeal-v
type: LexicalEntry
canonical form: squeal
sense: 01056566-v
part of speech: verb

oink-v
type: LexicalEntry
canonical form: oink
sense: 01056566-v
part of speech: verb

01056566-v
type: LexicalConcept
in scheme: en-word.net
definition: utter a high-pitched cry, characteristic of pigs
ili: i26852
lexfile: verb.communication
part of speech: verb
hypernym: 00985856-v