purr-v
type: LexicalEntry
canonical form: purr
sense: 01054808-v
part of speech: verb

make vibrant sounds-v
type: LexicalEntry
canonical form: make vibrant sounds
sense: 01054808-v
part of speech: verb

01054808-v
type: LexicalConcept
in scheme: en-word.net
definition: indicate pleasure by purring; characteristic of cats
ili: i26841
lexfile: verb.communication
part of speech: verb
hypernym: 02180402-v