quaver-v
type: LexicalEntry
canonical form: quaver
sense: 01052990-v
part of speech: verb

waver-v
type: LexicalEntry
canonical form: waver
sense: 01052990-v
part of speech: verb

01052990-v
type: LexicalConcept
in scheme: en-word.net
definition: give off unsteady sounds, alternating in amplitude or frequency
ili: i26830
lexfile: verb.communication
part of speech: verb
hypernym: 00954214-v