mouth-v
type: LexicalEntry
canonical form: mouth
sense: 01042579-v
part of speech: verb

01042579-v
type: LexicalConcept
in scheme: en-word.net
definition: articulate silently; form words with the lips only
example: She mouthed a swear word
ili: i26773
lexfile: verb.communication
part of speech: verb
hypernym: 00839722-v