confirmation-n
type: LexicalEntry
canonical form: confirmation
sense: 01040927-n
part of speech: noun

01040927-n
type: LexicalConcept
in scheme: en-word.net
definition: a ceremony held in the synagogue (usually at Pentecost) to admit as adult members of the Jewish community young men and women who have successfully completed a course of study in Judaism
ili: i40845
lexfile: noun.act
part of speech: noun
hypernym: 01030024-n