office-n
type: LexicalEntry
canonical form: office
sense: 01035490-n
part of speech: noun

01035490-n
type: LexicalConcept
in scheme: en-word.net
definition: a religious rite or service prescribed by ecclesiastical authorities
example: the offices of the mass
ili: i40815
lexfile: noun.act
part of speech: noun
hypernym: 01031438-n