express-v
type: LexicalEntry
canonical form: express
sense: 01033789-v
part of speech: verb

01033789-v
type: LexicalConcept
in scheme: en-word.net
definition: send by rapid transport or special messenger service
example: She expressed the letter to Florida
ili: i26732
lexfile: verb.communication
part of speech: verb
hypernym: 01033289-v