orgy-n
type: LexicalEntry
canonical form: orgy
sense: 01032312-n
part of speech: noun

01032312-n
type: LexicalConcept
in scheme: en-word.net
definition: secret rite in the cults of ancient Greek or Roman deities involving singing and dancing and drinking and sexual activity
ili: i40798
lexfile: noun.act
part of speech: noun
hypernym: 01031438-n