vigil-n
type: LexicalEntry
canonical form: vigil
sense: 01031703-n
part of speech: noun

watch-n
type: LexicalEntry
canonical form: watch
sense: 01031703-n
part of speech: noun

01031703-n
type: LexicalConcept
in scheme: en-word.net
definition: the rite of staying awake for devotional purposes (especially on the eve of a religious festival)
ili: i40794
lexfile: noun.act
part of speech: noun
domain topic: 05955536-n
hypernym: 01031438-n