routine-n
type: LexicalEntry
canonical form: routine
sense: 01028424-n
part of speech: noun

modus operandi-n
type: LexicalEntry
canonical form: modus operandi
sense: 01028424-n
part of speech: noun

01028424-n
type: LexicalConcept
in scheme: en-word.net
definition: an unvarying or habitual method or procedure
ili: i40779
lexfile: noun.act
part of speech: noun
hypernym: 01025762-n