name-v
type: LexicalEntry
canonical form: name
sense: 01028104-v
part of speech: verb

identify-v
type: LexicalEntry
canonical form: identify
sense: 01028104-v
part of speech: verb

01028104-v
type: LexicalConcept
in scheme: en-word.net
definition: give the name or identifying characteristics of; refer to by name or some other identifying characteristic property
example: Many senators were named in connection with the scandal
example: The almanac identifies the auspicious months
ili: i26706
lexfile: verb.communication
part of speech: verb
hypernym: 00933429-v