raise-v
type: LexicalEntry
canonical form: raise
sense: 01027255-v
part of speech: verb

bring up-v
type: LexicalEntry
canonical form: bring up
sense: 01027255-v
part of speech: verb

01027255-v
type: LexicalConcept
in scheme: en-word.net
definition: put forward for consideration or discussion
example: raise the question of promotions
example: bring up an unpleasant topic
ili: i26701
lexfile: verb.communication
part of speech: verb
hypernym: 01026199-v