mapping-n
type: LexicalEntry
canonical form: mapping
sense: 01026585-n
part of speech: noun

chromosome mapping-n
type: LexicalEntry
canonical form: chromosome mapping
sense: 01026585-n
part of speech: noun

01026585-n
type: LexicalConcept
in scheme: en-word.net
definition: (genetics) the process of locating genes on a chromosome
ili: i40769
lexfile: noun.act
part of speech: noun
domain topic: 06085077-n
hypernym: 01025762-n