iteration-n
type: LexicalEntry
canonical form: iteration
sense: 01021071-n
part of speech: noun

01021071-n
type: LexicalConcept
in scheme: en-word.net
definition: doing or saying again; a repeated performance
ili: i40740
lexfile: noun.act
part of speech: noun
hypernym: 01020572-n