alignment-n
type: LexicalEntry
canonical form: alignment
sense: 01002010-n
part of speech: noun

01002010-n
type: LexicalConcept
in scheme: en-word.net
definition: the act of adjusting or aligning the parts of a device in relation to each other
ili: i40635
lexfile: noun.act
part of speech: noun
hypernym: 01001729-n