fire-n
type: LexicalEntry
canonical form: fire
sense: 00989024-n
part of speech: noun

firing-n
type: LexicalEntry
canonical form: firing
sense: 00989024-n
part of speech: noun

00989024-n
type: LexicalConcept
in scheme: en-word.net
definition: the act of firing weapons or artillery at an enemy
example: hold your fire until you can see the whites of their eyes
example: they retreated in the face of withering enemy fire
ili: i40566
lexfile: noun.act
part of speech: noun
hypernym: 00974725-n