assault-n
type: LexicalEntry
canonical form: assault
sense: 00976530-n
part of speech: noun

00976530-n
type: LexicalConcept
in scheme: en-word.net
definition: close fighting during the culmination of a military attack
ili: i40501
lexfile: noun.act
part of speech: noun
domain topic: 08215965-n
hypernym: 00955670-n