sortie-n
type: LexicalEntry
canonical form: sortie
sense: 00973413-n
part of speech: noun

sally-n
type: LexicalEntry
canonical form: sally
sense: 00973413-n
part of speech: noun

00973413-n
type: LexicalConcept
in scheme: en-word.net
definition: a military action in which besieged troops burst forth from their position
ili: i40489
lexfile: noun.act
part of speech: noun
domain topic: 08215965-n
hypernym: 00955074-n