smatter-v
type: LexicalEntry
canonical form: smatter
sense: 00965993-v
part of speech: verb

00965993-v
type: LexicalConcept
in scheme: en-word.net
definition: speak with spotty or superficial knowledge
example: She smatters Russian
ili: i26415
lexfile: verb.communication
part of speech: verb
hypernym: 00965602-v