define-v
type: LexicalEntry
canonical form: define
sense: 00959410-v
part of speech: verb

00959410-v
type: LexicalConcept
in scheme: en-word.net
definition: give a definition for the meaning of a word
example: Define ‘sadness’
ili: i26382
lexfile: verb.communication
part of speech: verb
hypernym: 00949109-v