aim-v
type: LexicalEntry
canonical form: aim
sense: 00957504-v
part of speech: verb

00957504-v
type: LexicalConcept
in scheme: en-word.net
definition: direct (a remark) toward an intended goal
example: She wanted to aim a pun
ili: i26376
lexfile: verb.communication
part of speech: verb
hypernym: 00957180-v