orchestration-n
type: LexicalEntry
canonical form: orchestration
sense: 00941634-n
part of speech: noun

instrumentation-n
type: LexicalEntry
canonical form: instrumentation
sense: 00941634-n
part of speech: noun

00941634-n
type: LexicalConcept
in scheme: en-word.net
definition: the act of arranging a piece of music for an orchestra and assigning parts to the different musical instruments
ili: i40344
lexfile: noun.act
part of speech: noun
hypernym: 00941444-n