spring-v
type: LexicalEntry
canonical form: spring
sense: 00937859-v
part of speech: verb

00937859-v
type: LexicalConcept
in scheme: en-word.net
definition: produce or disclose suddenly or unexpectedly
example: He sprang the news on me just as I was leaving
ili: i26284
lexfile: verb.communication
part of speech: verb
hypernym: 00935783-v