embodiment-n
type: LexicalEntry
canonical form: embodiment
sense: 00934815-n
part of speech: noun

00934815-n
type: LexicalConcept
in scheme: en-word.net
definition: giving concrete form to an abstract concept
ili: i40311
lexfile: noun.act
part of speech: noun
hypernym: 00933903-n