upset-a
type: LexicalEntry
canonical form: upset
sense: 00934664-s
part of speech: adjective

00934664-s
type: LexicalConcept
in scheme: en-word.net
definition: used of an unexpected defeat of a team favored to win
example: the Bills' upset victory over the Houston Oilers
ili: i5103
lexfile: adj.all
part of speech: adjective satellite
similar: https://en-word.net/synset/00933531-a