zoning-n
type: LexicalEntry
canonical form: zoning
sense: 00930566-n
part of speech: noun

00930566-n
type: LexicalConcept
in scheme: en-word.net
definition: dividing an area into zones or sections reserved for different purposes such as residence and business and manufacturing etc
ili: i40291
lexfile: noun.act
part of speech: noun
hypernym: 00398761-n