speculate-v
type: LexicalEntry
canonical form: speculate
sense: 00929020-v
part of speech: verb

00929020-v
type: LexicalConcept
in scheme: en-word.net
definition: talk over conjecturally, or review in an idle or casual way and with an element of doubt or without sufficient reason to reach a conclusion
example: We were speculating whether the President had to resign after the scandal
ili: i26246
lexfile: verb.communication
part of speech: verb
hypernym: 00634289-v