prophesy-v
type: LexicalEntry
canonical form: prophesy
sense: 00928673-v
part of speech: verb

vaticinate-v
type: LexicalEntry
canonical form: vaticinate
sense: 00928673-v
part of speech: verb

00928673-v
type: LexicalConcept
in scheme: en-word.net
definition: predict or reveal through, or as if through, divine inspiration
ili: i26244
lexfile: verb.communication
part of speech: verb
hypernym: 00919743-v