cultivation-n
type: LexicalEntry
canonical form: cultivation
sense: 00917553-n
part of speech: noun

00917553-n
type: LexicalConcept
in scheme: en-word.net
definition: (agriculture) production of food by preparing the land to grow crops (especially on a large scale)
ili: i40221
lexfile: noun.act
part of speech: noun
domain topic: 00918295-n
hypernym: 00915536-n