flush-a
type: LexicalEntry
canonical form: flush
sense: 00913656-s
part of speech: adjective

00913656-s
type: LexicalConcept
in scheme: en-word.net
definition: of a surface exactly even with an adjoining one, forming the same plane
example: a door flush with the wall
example: the bottom of the window is flush with the floor
ili: i4982
lexfile: adj.all
part of speech: adjective satellite
similar: https://en-word.net/synset/00912628-a