imaging-n
type: LexicalEntry
canonical form: imaging
sense: 00902781-n
part of speech: noun

tomography-n
type: LexicalEntry
canonical form: tomography
sense: 00902781-n
part of speech: noun

00902781-n
type: LexicalConcept
in scheme: en-word.net
definition: (medicine) obtaining pictures of the interior of the body
ili: i40142
lexfile: noun.act
part of speech: noun
domain topic: 06052606-n
hypernym: 00902073-n