dismiss-v
type: LexicalEntry
canonical form: dismiss
sense: 00902491-v
part of speech: verb

usher out-v
type: LexicalEntry
canonical form: usher out
sense: 00902491-v
part of speech: verb

00902491-v
type: LexicalConcept
in scheme: en-word.net
definition: end one's encounter with somebody by causing or permitting the person to leave
example: I was dismissed after I gave my report
ili: i26120
lexfile: verb.communication
part of speech: verb
hypernym: 00902724-v