bow-v-1
type: LexicalEntry
canonical form: bow
sense: 00900454-v
part of speech: verb

bow down-v
type: LexicalEntry
canonical form: bow down
sense: 00900454-v
part of speech: verb

00900454-v
type: LexicalConcept
in scheme: en-word.net
definition: bend one's knee or body, or lower one's head
example: He bowed before the King
example: She bowed her head in shame
ili: i26108
lexfile: verb.communication
part of speech: verb
hypernym: 00994073-v