absolute-a
type: LexicalEntry
canonical form: absolute
sense: 00900308-s
part of speech: adjective

00900308-s
type: LexicalConcept
in scheme: en-word.net
definition: expressing finality with no implication of possible change
example: an absolute guarantee to respect the nation's authority
ili: i4917
lexfile: adj.all
part of speech: adjective satellite
similar: https://en-word.net/synset/00899848-a