representation-n
type: LexicalEntry
canonical form: representation
sense: 00900216-n
part of speech: noun

00900216-n
type: LexicalConcept
in scheme: en-word.net
definition: an activity that stands as an equivalent of something or results in an equivalent
ili: i40128
lexfile: noun.act
part of speech: noun
hypernym: 00408356-n