even-a
type: LexicalEntry
canonical form: even
sense: 00894463-s
part of speech: adjective

fifty-fifty-a
type: LexicalEntry
canonical form: fifty-fifty
sense: 00894463-s
part of speech: adjective

00894463-s
type: LexicalConcept
in scheme: en-word.net
definition: equal in degree or extent or amount; or equally matched or balanced
example: even amounts of butter and sugar
example: on even terms
example: it was a fifty-fifty (or even) split
example: had a fifty-fifty (or even) chance
example: an even fight
ili: i4885
lexfile: adj.all
part of speech: adjective satellite
similar: https://en-word.net/synset/00893124-a